{"text_format":"1","workbook":"xlsx","n_sheets":5,"sheets":["Outputs Monthly","DownloadBudgetData (1)","Timeliness Quarterly","CAP Count Summary","Action Plan Summary"],"not_rendered":{"charts":0,"images":0,"macros":0,"external_links":0,"defined_names":4,"comments":0,"pivot_tables":0},"unopened":[],"bounds":{"document_bytes":16777216,"sheet_cells":100000,"rows_first":2000,"rows_last":500,"rows_between":2000,"halvings":0,"cell_chars":16384,"cell_head_chars":4096},"cells_cut":0,"cells_raw":0,"read":"whole","date_system":"1900"}

{"sheet":"Outputs Monthly","index":0,"n_rows":143,"n_cols":702,"rows_kept":143,"cut":false,"hidden":false,"merged":[[7,13,7,15],[5,3,5,4],[6,3,6,4],[7,3,7,4],[7,6,7,7],[7,10,7,11],[3,13,5,15]]}
[null,null,null,null,null,null,null,null,null,null,null,null,null,"Annual Financial Receipts"]
[null,"County Fiscal Year 2014-15",null,null,null,null,null,null,null,null,null,null,null,"Total Number of Financial Receipts for the Year:","Projected","Actual"]
[null,"Outputs Monthly Report Form for CCOC",null,null,null,null,null,null,null,null,null,null,null,null,{"$f":"LOOKUP(D8,'DownloadBudgetData (1)'!B2:B68,'DownloadBudgetData (1)'!AG2:AG68)","v":453519}]
[null,null,null,null,null,null,null,null,null,null,null,null,null,"Financial Receipts are totaled for the full fiscal year and entered here annually. This annual total is to be reported on the September submission."]
[]
[null,null,"Report for the Month of: ","Jun"]
[null,null,"Version #: ",1]
[null,null,"County: ","Brevard",null,"Contact:","Michelle Levar",null,null,"Telephone:","321-633-7782",null,"E-mail:","michelle.levar@brevardclerk.us"]
[]
[]
[null,null,null,null,null,"Criminal",null,null,null,null,null,null,"Civil"]
[null,null,null,"Circuit","County","Juvenile Delinquency","Traffic","Total",null,"Circuit","County","Traffic","Probate","Family","Juvenile Dependency","Total",null,"Grand Total"]
[null,"Projections"]
[null,null,"Cases/Defendants",{"$f":"LOOKUP(D8,'DownloadBudgetData (1)'!B2:B68,'DownloadBudgetData (1)'!C2:C68)","v":9500},{"$f":"LOOKUP(D8,'DownloadBudgetData (1)'!B2:B68,'DownloadBudgetData (1)'!D2:D68)","v":10500},{"$f":"LOOKUP(D8,'DownloadBudgetData (1)'!B2:B68,'DownloadBudgetData (1)'!E2:E68)","v":1800},{"$f":"LOOKUP(D8,'DownloadBudgetData (1)'!B2:B68,'DownloadBudgetData (1)'!F2:F68)","v":9000},{"$f":"SUM(D14:G14)","v":30800},null,{"$f":"LOOKUP(D8,'DownloadBudgetData (1)'!B2:B68,'DownloadBudgetData (1)'!G2:G68)","v":6000},{"$f":"LOOKUP(D8,'DownloadBudgetData (1)'!B2:B68,'DownloadBudgetData (1)'!H2:H68)","v":7000},{"$f":"LOOKUP(D8,'DownloadBudgetData (1)'!B2:B68,'DownloadBudgetData (1)'!L2:L68)","v":59000},{"$f":"LOOKUP(D8,'DownloadBudgetData (1)'!B2:B68,'DownloadBudgetData (1)'!I2:I68)","v":4500},{"$f":"LOOKUP(D8,'DownloadBudgetData (1)'!B2:B68,'DownloadBudgetData (1)'!J2:J68)","v":7500},{"$f":"LOOKUP(D8,'DownloadBudgetData (1)'!B2:B68,'DownloadBudgetData (1)'!K2:K68)","v":300},{"$f":"SUM(J14:O14)","v":84300},null,{"$f":"H14+P14","v":115100}]
[null,null,"Reopenings",{"$f":"LOOKUP(D8,'DownloadBudgetData (1)'!B2:B68,'DownloadBudgetData (1)'!M2:M68)","v":7600},{"$f":"LOOKUP(D8,'DownloadBudgetData (1)'!B2:B68,'DownloadBudgetData (1)'!N2:N68)","v":2000},{"$f":"LOOKUP(D8,'DownloadBudgetData (1)'!B2:B68,'DownloadBudgetData (1)'!O2:O68)","v":2000},{"$f":"LOOKUP(D8,'DownloadBudgetData (1)'!B2:B68,'DownloadBudgetData (1)'!P2:P68)","v":2100},{"$f":"SUM(D15:G15)","v":13700},null,{"$f":"LOOKUP(D8,'DownloadBudgetData (1)'!B2:B68,'DownloadBudgetData (1)'!Q2:Q68)","v":5200},{"$f":"LOOKUP(D8,'DownloadBudgetData (1)'!B2:B68,'DownloadBudgetData (1)'!R2:R68)","v":3800},0,{"$f":"LOOKUP(D8,'DownloadBudgetData (1)'!B2:B68,'DownloadBudgetData (1)'!S2:S68)","v":1800},{"$f":"LOOKUP(D8,'DownloadBudgetData (1)'!B2:B68,'DownloadBudgetData (1)'!T2:T68)","v":7300},{"$f":"LOOKUP(D8,'DownloadBudgetData (1)'!B2:B68,'DownloadBudgetData (1)'!U2:U68)","v":450},{"$f":"SUM(J15:O15)","v":18550},null,{"$f":"H15+P15","v":32250}]
{"$rows_left_out":129}
{"sheet":"DownloadBudgetData (1)","index":1,"n_rows":68,"n_cols":33,"rows_kept":68,"cut":false,"hidden":true,"merged":[]}
["FiscalYear","County","Outputs_NewCases_CrimCir","Outputs_NewCases_CrimCounty","Outputs_NewCases_CrimJuvDel","Outputs_NewCases_CrimTraf","Outputs_NewCases_CivCir","Outputs_NewCases_CivCounty","Outputs_NewCases_CivProbate","Outputs_NewCases_CivFamily","Outputs_NewCases_CivJuvDep","Outputs_NewCases_CivTraf","Outputs_Reopens_CrimCir","Outputs_Reopens_CrimCounty","Outputs_Reopens_CrimJuvDel","Outputs_Reopens_CrimTraf","Outputs_Reopens_CivCir","Outputs_Reopens_CivCounty","Outputs_Reopens_CivProbate","Outputs_Reopens_CivFamily","Outputs_Reopens_CivJuvDep","Outputs_Reopens_CivTraf","Outputs_NoticesOfAppeal_CrimCir","Outputs_NoticesOfAppeal_CrimCounty","Outputs_NoticesOfAppeal_CrimJuvDel","Outputs_NoticesOfAppeal_CrimTraf","Outputs_NoticesOfAppeal_CivCir","Outputs_NoticesOfAppeal_CivCounty","Outputs_NoticesOfAppeal_CivProbate","Outputs_NoticesOfAppeal_CivFamily","Outputs_NoticesOfAppeal_CivJuvDep","Outputs_NoticesOfAppeal_CivTraf","Outputs_FinReceipts"]
["2014-2015","Alachua",4600,6200,1400,5400,1950,3900,2100,2650,180,61000,2000,750,850,1455,1500,2800,1600,4700,270,0,180,12,5,7,80,3,3,4700,270,0,150000]
["2014-2015","Baker",530,771,89,415,256,209,192,544,108,3631,296,467,27,125,23,26,74,228,7,0,10,467,27,125,1,26,1,228,7,0,32467]
["2014-2015","Bay",4288,8669,1142,4622,1606,2651,1472,2371,314,33259,2260,972,559,676,1182,798,45,1973,1102,0,210,5,5,2,30,3,2,10,12,0,76286]
["2014-2015","Bradford",820,600,80,375,250,300,100,350,8,7700,250,190,30,135,60,45,12,235,8,0,1,190,30,135,10,45,12,235,8,0,12500]
["2014-2015","Brevard",9500,10500,1800,9000,6000,7000,4500,7500,300,59000,7600,2000,2000,2100,5200,3800,1800,7300,450,0,600,25,3,25,80,20,10,35,20,15,453519]
["2014-2015","Broward",17880,26900,5640,32460,26040,62130,10100,24220,900,389160,11640,8000,3700,9360,46080,31560,430,22180,2520,0,840,90,70,0,660,180,30,120,20,10,925000]
["2014-2015","Calhoun",210,240,30,125,75,120,55,240,10,1600,160,45,6,40,7,10,1,60,10,0,19,45,6,40,3,10,1,60,1,0,4900]
["2014-2015","Charlotte",2200,2500,650,2500,1500,1950,2300,2000,100,16000,1100,450,320,525,1100,450,450,650,35,0,84,7,3,3,35,4,2,1,4,1,52000]
["2014-2015","Citrus",1550,2098,300,1100,1650,1700,1450,2000,185,9000,2700,1100,180,700,1028,715,800,1460,850,0,143,2,2,1,24,4,3,4,12,2,130000]
["2014-2015","Clay",2200,2450,802,2060,1700,2330,891,2300,295,21900,1060,435,305,586,930,560,36,1770,1641,0,10,1,1,2,22,5,1,12,4,1,56567]
["2014-2015","Collier",2550,4200,850,5100,2900,3800,3400,3000,300,41300,1750,1400,240,1200,3800,1500,1250,2800,400,0,120,1,1,7,80,30,1,3,22,1,204000]
["2014-2015","Columbia",1000,1400,300,1100,550,1110,500,1300,140,11000,1200,350,160,425,130,150,20,1050,90,0,60,350,160,1,15,2,1,1,1,1,23000]
["2014-2015","Dade",33100,54000,5100,76000,40000,82700,12000,31000,4000,822000,28000,15200,5300,50000,65000,26000,30000,24400,9550,0,1100,40,100,30,960,330,33,115,80,0,2200000]
["2014-2015","Desoto",550,730,250,435,250,312,125,450,40,5000,200,90,20,75,30,5,1,5,15,0,15,5,2,1,15,1,1,1,5,1,9000]
{"$rows_left_out":54}
{"sheet":"Timeliness Quarterly","index":2,"n_rows":82,"n_cols":702,"rows_kept":82,"cut":false,"hidden":false,"merged":[[75,10,77,10],[75,11,77,11],[75,12,77,12],[75,13,77,13],[75,14,77,14],[75,15,77,15],[75,16,77,16],[75,17,77,17],[69,10,71,10],[69,11,71,11],[69,12,71,12],[69,13,71,13],[69,14,71,14],[69,15,71,15],[69,16,71,16],[69,17,71,17],[72,10,74,10],[72,11,74,11],[72,12,74,12],[72,13,74,13],[72,14,74,14],[72,15,74,15],[72,16,74,16],[72,17,74,17],[63,10,65,10],[63,11,65,11],[63,12,65,12],[63,13,65,13],[63,14,65,14],[63,15,65,15],[63,16,65,16],[63,17,65,17],[66,10,68,10],[66,11,68,11],[66,12,68,12],[66,13,68,13],[66,14,68,14],[66,15,68,15],[66,16,68,16],[66,17,68,17],[56,10,58,10],[56,11,58,11],[56,12,58,12],[56,13,58,13],[56,14,58,14],[56,15,58,15],[56,16,58,16],[56,17,58,17],[60,10,62,10],[60,11,62,11],[60,12,62,12],[60,13,62,13],[60,14,62,14],[60,15,62,15],[60,16,62,16],[60,17,62,17],[50,10,52,10],[50,11,52,11],[50,12,52,12],[50,13,52,13],[50,14,52,14],[50,15,52,15],[50,16,52,16],[50,17,52,17],[53,10,55,10],[53,11,55,11],[53,12,55,12],[53,13,55,13],[53,14,55,14],[53,15,55,15],[53,16,55,16],[53,17,55,17],[45,10,45,11],[45,12,45,13],[45,14,45,15],[45,16,45,17],[47,10,49,10],[47,11,49,11],[47,12,49,12],[47,13,49,13],[47,14,49,14],[47,15,49,15],[47,16,49,16],[47,17,49,17],[36,10,38,10],[36,11,38,11],[36,12,38,12],[36,13,38,13],[36,14,38,14],[36,15,38,15],[36,16,38,16],[36,17,38,17],[39,10,41,10],[39,11,41,11],[39,12,41,12],[39,13,41,13],[39,14,41,14],[39,15,41,15],[39,16,41,16],[39,17,41,17],[30,10,32,10],[30,11,32,11],[30,12,32,12],[30,13,32,13],[30,14,32,14],[30,15,32,15],[30,16,32,16],[30,17,32,17],[33,10,35,10],[33,11,35,11],[33,12,35,12],[33,13,35,13],[33,14,35,14],[33,15,35,15],[33,16,35,16],[33,17,35,17],[24,12,26,12],[24,13,26,13],[24,14,26,14],[24,15,26,15],[24,16,26,16],[24,17,26,17],[20,14,22,14],[27,12,29,12],[27,13,29,13],[27,14,29,14],[27,15,29,15],[27,16,29,16],[27,17,29,17],[20,15,22,15],[20,16,22,16],[20,17,22,17],[9,14,9,15],[11,14,13,14],[11,15,13,15],[14,14,16,14],[14,15,16,15],[17,14,19,14],[17,15,19,15],[9,16,9,17],[11,16,13,16],[11,17,13,17],[14,16,16,16],[14,17,16,17],[17,16,19,16],[17,17,19,17],[9,12,9,13],[11,12,13,12],[11,13,13,13],[14,12,16,12],[14,13,16,13],[17,12,19,12],[17,13,19,13],[20,12,22,12],[20,13,22,13],[9,10,9,11],[11,10,13,10],[11,11,13,11],[14,10,16,10],[14,11,16,11],[27,10,29,10],[27,11,29,11],[17,10,19,10],[17,11,19,11],[20,10,22,10],[20,11,22,11],[24,10,26,10],[24,11,26,11],[72,3,74,3],[72,4,74,4],[63,0,65,1],[63,3,65,3],[63,4,65,4],[66,0,68,1],[66,3,68,3],[66,4,68,4],[81,2,81,8],[75,0,77,1],[75,3,77,3],[75,4,77,4],[69,0,71,1],[69,3,71,3],[69,4,71,4],[72,0,74,1],[47,0,49,1],[47,3,49,3],[47,4,49,4],[50,0,52,1],[50,3,52,3],[50,4,52,4],[60,0,62,1],[60,3,62,3],[60,4,62,4],[53,0,55,1],[53,3,55,3],[53,4,55,4],[56,0,58,1],[56,3,58,3],[56,4,58,4],[59,1,59,2],[39,0,41,1],[30,0,32,1],[33,0,35,1],[36,0,38,1],[36,3,38,3],[23,1,23,2],[45,3,46,3],[45,4,46,4],[46,1,46,2],[30,4,32,4],[27,3,29,3],[27,4,29,4],[39,3,41,3],[39,4,41,4],[33,3,35,3],[33,4,35,4],[36,4,38,4],[30,3,32,3],[24,3,26,3],[24,4,26,4],[24,0,26,1],[27,0,29,1],[14,0,16,1],[11,0,13,1],[17,4,19,4],[17,0,19,1],[20,4,22,4],[10,1,10,2],[9,4,10,4],[9,3,10,3],[11,3,13,3],[14,3,16,3],[17,3,19,3],[20,0,22,1],[6,6,6,8],[4,3,4,4],[4,6,4,7],[6,3,6,4],[5,6,5,7],[5,3,5,4],[20,3,22,3],[11,4,13,4],[14,4,16,4]]}
[]
[null,"County Fiscal Year 2014 - 2015"]
[null,"Timeliness Quarterly Report Form for CCOC"]
[]
[null,null,"Report Month of (Quarter Ending): ",{"$f":"'Outputs Monthly'!D6:E6","v":"Jun"},null,"Contact:","Michelle Levar"]
[null,null,"Version #: ",{"$f":"'Outputs Monthly'!D7:E7","v":1},null,"Telephone:","321-633-7782"]
[null,null,"County: ",{"$f":"'Outputs Monthly'!D8:E8","v":"Brevard"},null,"E-mail:","michelle.levar@brevardclerk.us"]
[]
["Timeliness Measures #1: Annual Projected % of new cases OPENED within X business days after initial documents are clocked in."]
[null,null,null,"Performance Measure Standard","# of business days","10/1/14 - 12/31/14","1/1/15 - 3/31/15","4/1/15 - 6/30/15","7/1/15 - 9/30/15",null,{"$f":"F10","v":"10/1/14 - 12/31/14"},null,{"$f":"G10","v":"1/1/15 - 3/31/15"},null,{"$f":"H10","v":"4/1/15 - 6/30/15"},null,{"$f":"I10","v":"7/1/15 - 9/30/15"}]
["A","Criminal",null,null,null,"1st Quarter","2nd Quarter","3rd Quarter","4th Quarter","Year-to-Date","Reason Code","Actions to Improve","Reason Code","Actions to Improve","Reason Code","Actions to Improve","Reason Code","Actions to Improve",null,1]
["Circuit (defendants)",null,"Total # of defendants",0.8,2,{"$f":"'Outputs Monthly'!D18+'Outputs Monthly'!D22+'Outputs Monthly'!D26","v":1775},{"$f":"'Outputs Monthly'!D30+'Outputs Monthly'!D34+'Outputs Monthly'!D38","v":1916},{"$f":"'Outputs Monthly'!D42+'Outputs Monthly'!D46+'Outputs Monthly'!D50","v":1986},{"$f":"'Outputs Monthly'!D54+'Outputs Monthly'!D58+'Outputs Monthly'!D62","v":662},{"$f":"SUM(F12:I12)","v":6339}]
[null,null,"# within 2 business days",null,null,1759,1883,1928,657,{"$f":"SUM(F13:I13)","v":6227},null,null,null,null,null,null,null,null,null,"E-Filing"]
[null,null,"% mtg level",null,null,{"$f":"F13/F12","v":0.99098591549295778},{"$f":"G13/G12","v":0.98277661795407101},{"$f":"H13/H12","v":0.97079556898288011},{"$f":"I13/I12","v":0.99244712990936557},{"$f":"J13/J12","v":0.9823315980438555},null,null,null,null,null,null,null,null,null,"Procedural"]
["County (defendants)",null,"Total # of defendants",0.8,3,{"$f":"'Outputs Monthly'!E18+'Outputs Monthly'!E22+'Outputs Monthly'!E26","v":2334},{"$f":"'Outputs Monthly'!E30+'Outputs Monthly'!E34+'Outputs Monthly'!E38","v":2357},{"$f":"'Outputs Monthly'!E42+'Outputs Monthly'!E46+'Outputs Monthly'!E50","v":2577},{"$f":"'Outputs Monthly'!E54+'Outputs Monthly'!E58+'Outputs Monthly'!E62","v":878},8146,null,null,null,null,null,null,null,null,null,"Staffing - Insufficient Personnel"]
{"$rows_left_out":68}
{"sheet":"CAP Count Summary","index":3,"n_rows":70,"n_cols":44,"rows_kept":70,"cut":false,"hidden":true,"merged":[[0,22,0,40]]}
["County","TIMELINESS STANDARD ONE (New Cases Opened)",null,null,null,null,null,null,null,null,null,null,null,null,null,null,null,null,null,null,null,null,"TIMELINESS STANDARD TWO (Docket Entries Processed)",null,null,null,null,null,null,null,null,null,null,null,null,null,null,null,null,null,null,null,null,"Sent Date"]
[null,"Circuit Criminal Reason","Improve Action","County Criminal Reason","Improve Action","Juvenile Delinquency Reason ","Improve Action","Criminal Traffic Reason ","Improve Action","Circuit Civil Reason","Improve Action","County Civil Reason","Improve Action","Civil Traffic Reason","Improve Action","Probate Reason","Improve Action","Family Reason","Improve Action","Juvenile Dependency Reason","Improve Action",null,"Circuit Criminal Reason","Improve Action","County Criminal Reason","Improve Action","Juvenile Delinquency Reason","Improve Action","Criminal Traffic Reason","Improve Action","Circuit Civil Reason","Improve Action","County Civil Reason","Improve Action","Civil Traffic Reason","Improve Action","Probate Reason","Improve Action","Family Reason","Improve Action","Juvenile Dependency Reason ","Improve Action"]
[]
["Alachua",null,null,null,null,null,null,null,null,null,null,null,null,null,null,null,null,null,null,null,null,null,null,null,null,null,null,null,null,null,null,null,null,null,null,null,null,null,null,null,null,null,null,20140220]
["Baker",null,null,null,null,null,null,null,null,null,null,null,null,null,null,null,null,null,null,null,null,null,null,null,null,null,null,null,null,null,null,null,null,null,null,null,null,null,null,null,null,null,null,20140207]
["Bay",null,null,null,null,null,null,null,null,null,null,null,null,null,null,null,null,null,null,null,null,null,null,null,null,null,null,null,null,null,null,null,null,null,null,null,null,null,null,null,null,null,null,20140218]
["Bradford",null,null,null,null,null,null,null,null,null,null,null,null,null,null,null,null,null,null,null,null,null,null,null,null,null,"Procedural","We are a small county with several Supreme Court death warrant appeals that had priority. ",null,null,null,null,null,null,null,null,null,null,null,null,"Procedural","We are a small county with several Supreme Court death warrant appeals that had priority. ",null,20140218]
["Brevard",null,null,null,null,null,null,null,null,null,null,null,null,null,null,null,null,null,null,null,null,null,null,null,null,null,null,null,null,null,null,null,null,null,null,null,null,null,null,null,null,null,null,20140218]
["Broward",null,null,null,null,null,null,null,null,null,null,null,null,null,null,"E-Filing","A high percentage of cases are rejected. When cases are resubmitted, the calculation for timeliness is based on the original file date.",null,null,null,null,null,null,null,null,null,null,null,null,null,null,null,null,null,null,null,null,null,null,null,"Systems","The division is still adjusting to new case maintenance system. E-filing should assist with improving the timeliness.",null,20140218]
["Calhoun",null,null,null,null,null,null,null,null,null,null,null,null,null,null,null,null,null,null,null,null,null,null,null,null,null,null,null,null,null,null,null,null,null,null,null,null,null,null,null,null,null,null,20140217]
["Charlotte",null,null,null,null,null,null,null,null,null,null,null,null,null,null,null,null,null,null,null,null,null,null,null,null,null,null,null,null,null,null,null,null,null,null,null,null,null,null,null,null,null,null,20140219]
["Citrus",null,null,null,null,null,null,null,null,null,null,null,null,null,null,null,null,null,null,null,null,null,null,null,null,null,null,null,null,null,null,null,null,null,null,null,null,null,null,null,null,null,null,20140206]
["Clay",null,null,null,null,null,null,null,null,null,null,null,null,null,null,null,null,null,null,null,null,null,null,null,null,null,null,null,null,null,null,null,null,null,null,null,null,null,null,null,null,null,null,20140218]
["Collier",null,null,null,null,null,null,null,null,null,null,null,null,null,null,null,null,null,null,null,null,null,null,null,null,null,null,null,null,null,null,null,null,null,null,null,null,null,null,null,null,null,null,20140220]
["Columbia",null,null,null,null,null,null,null,null,null,null,null,null,null,null,null,null,null,null,"Staffing - Insufficient Personnel","This is a one employee department. Employees in other departments will be used to cover this when employee is out.",null,null,null,null,null,null,null,null,null,null,null,null,null,null,null,null,null,null,null,null,null,null,20140219]
{"$rows_left_out":56}
{"sheet":"Action Plan Summary","index":4,"n_rows":92,"n_cols":7,"rows_kept":92,"cut":false,"hidden":false,"merged":[[88,0,91,0],[64,0,67,0],[68,0,71,0],[72,0,75,0],[76,0,79,0],[80,0,83,0],[84,0,87,0],[37,0,40,0],[41,0,44,0],[52,0,55,0],[56,0,59,0],[60,0,63,0],[45,0,48,0],[17,0,20,0],[21,0,24,0],[25,0,28,0],[29,0,32,0],[33,0,36,0],[4,3,4,4],[5,3,5,4],[6,3,6,4],[9,0,12,0],[13,0,16,0]]}
[]
["County Fiscal Year 2014 - 2015"]
["Timeliness Quarterly Action Plan Form for CCOC"]
[]
[null,null,"Report Month of (Quarter Ending): ",{"$f":"'Outputs Monthly'!D6:E6","v":"Jun"},null,"Contact:"]
[null,null,"Version #: ",{"$f":"'Outputs Monthly'!D7:E7","v":1},null,"Telephone:"]
[null,null,"County: ",{"$f":"'Outputs Monthly'!D8:E8","v":"Brevard"},null,"E-mail:"]
[]
[" \nTimeliness Measeure # 1","Quarter","CCOC Standard",{"$f":"'Timeliness Quarterly'!E10","v":"# of business days"},"Clerk Performance","Reason Code","Current Actions to Improve"]
["Circuit Criminal",{"$f":"'Timeliness Quarterly'!$F$10","v":"10/1/14 - 12/31/14"},{"$f":"'Timeliness Quarterly'!$D$12","v":0.8},{"$f":"'Timeliness Quarterly'!$E$12","v":2},{"$f":"IF(IFERROR('Timeliness Quarterly'!F$14,\"error\")=\"error\",\"\",IF('Timeliness Quarterly'!F$14<'Timeliness Quarterly'!$D$12,'Timeliness Quarterly'!F$14,\"\"))","v":""},{"$f":"IF(IFERROR('Timeliness Quarterly'!$K$12,\"error\")=\"error\",\"\",IF('Timeliness Quarterly'!$K$12=0,\"\",'Timeliness Quarterly'!$K$12))","v":""},{"$f":"IF(IFERROR('Timeliness Quarterly'!$L$12,\"error\")=\"error\",\"\",IF('Timeliness Quarterly'!$L$12=0,\"\",'Timeliness Quarterly'!$L$12))","v":""}]
[null,{"$f":"'Timeliness Quarterly'!$G$10","v":"1/1/15 - 3/31/15"},{"$f":"'Timeliness Quarterly'!$D$12","v":0.8},{"$f":"'Timeliness Quarterly'!$E$12","v":2},{"$f":"IF(IFERROR('Timeliness Quarterly'!G$14,\"error\")=\"error\",\"\",IF('Timeliness Quarterly'!G$14<'Timeliness Quarterly'!$D$12,'Timeliness Quarterly'!G$14,\"\"))","v":""},{"$f":"IF(IFERROR('Timeliness Quarterly'!$M$12,\"error\")=\"error\",\"\",IF('Timeliness Quarterly'!$M$12=0,\"\",'Timeliness Quarterly'!$M$12))","v":""},{"$f":"IF(IFERROR('Timeliness Quarterly'!$N$12,\"error\")=\"error\",\"\",IF('Timeliness Quarterly'!$N$12=0,\"\",'Timeliness Quarterly'!$N$12))","v":""}]
[null,{"$f":"'Timeliness Quarterly'!$H$10","v":"4/1/15 - 6/30/15"},{"$f":"'Timeliness Quarterly'!$D$12","v":0.8},{"$f":"'Timeliness Quarterly'!$E$12","v":2},{"$f":"IF(IFERROR('Timeliness Quarterly'!H$14,\"error\")=\"error\",\"\",IF('Timeliness Quarterly'!H$14<'Timeliness Quarterly'!$D$12,'Timeliness Quarterly'!H$14,\"\"))","v":""},{"$f":"IF(IFERROR('Timeliness Quarterly'!$O$12,\"error\")=\"error\",\"\",IF('Timeliness Quarterly'!$O$12=0,\"\",'Timeliness Quarterly'!$O$12))","v":""},{"$f":"IF(IFERROR('Timeliness Quarterly'!$P$12,\"error\")=\"error\",\"\",IF('Timeliness Quarterly'!$P$12=0,\"\",'Timeliness Quarterly'!$P$12))","v":""}]
[null,{"$f":"'Timeliness Quarterly'!$I$10","v":"7/1/15 - 9/30/15"},{"$f":"'Timeliness Quarterly'!$D$12","v":0.8},{"$f":"'Timeliness Quarterly'!$E$12","v":2},{"$f":"IF(IFERROR('Timeliness Quarterly'!I$14,\"error\")=\"error\",\"\",IF('Timeliness Quarterly'!I$14<'Timeliness Quarterly'!$D$12,'Timeliness Quarterly'!I$14,\"\"))","v":""},{"$f":"IF(IFERROR('Timeliness Quarterly'!$Q$12,\"error\")=\"error\",\"\",IF('Timeliness Quarterly'!$Q$12=0,\"\",'Timeliness Quarterly'!$Q$12))","v":""},{"$f":"IF(IFERROR('Timeliness Quarterly'!$R$12,\"error\")=\"error\",\"\",IF('Timeliness Quarterly'!$R$12=0,\"\",'Timeliness Quarterly'!$R$12))","v":""}]
["County Criminal",{"$f":"'Timeliness Quarterly'!$F$10","v":"10/1/14 - 12/31/14"},{"$f":"'Timeliness Quarterly'!$D$15","v":0.8},{"$f":"'Timeliness Quarterly'!$E$15","v":3},{"$f":"IF(IFERROR('Timeliness Quarterly'!F$17,\"error\")=\"error\",\"\",IF('Timeliness Quarterly'!F$17<'Timeliness Quarterly'!$D$15,'Timeliness Quarterly'!F$17,\"\"))","v":""},{"$f":"IF(IFERROR('Timeliness Quarterly'!$K$15,\"error\")=\"error\",\"\",IF('Timeliness Quarterly'!$K$15=0,\"\",'Timeliness Quarterly'!$K$15))","v":""},{"$f":"IF(IFERROR('Timeliness Quarterly'!$L$15,\"error\")=\"error\",\"\",IF('Timeliness Quarterly'!$L$15=0,\"\",'Timeliness Quarterly'!$L$15))","v":""}]
[null,{"$f":"'Timeliness Quarterly'!$G$10","v":"1/1/15 - 3/31/15"},{"$f":"'Timeliness Quarterly'!$D$15","v":0.8},{"$f":"'Timeliness Quarterly'!$E$15","v":3},{"$f":"IF(IFERROR('Timeliness Quarterly'!G$17,\"error\")=\"error\",\"\",IF('Timeliness Quarterly'!G$17<'Timeliness Quarterly'!$D$15,'Timeliness Quarterly'!G$17,\"\"))","v":""},{"$f":"IF(IFERROR('Timeliness Quarterly'!$M$15,\"error\")=\"error\",\"\",IF('Timeliness Quarterly'!$M$15=0,\"\",'Timeliness Quarterly'!$M$15))","v":""},{"$f":"IF(IFERROR('Timeliness Quarterly'!$N$15,\"error\")=\"error\",\"\",IF('Timeliness Quarterly'!$N$15=0,\"\",'Timeliness Quarterly'!$N$15))","v":""}]
{"$rows_left_out":77}